php5.3.*编译出现make: *** [ext/gd/libgd/gd_compat.lo] Error 1 解决方法
生活随笔
收集整理的這篇文章主要介紹了
php5.3.*编译出现make: *** [ext/gd/libgd/gd_compat.lo] Error 1 解决方法
小編覺得挺不錯的,現在分享給大家,幫大家做個參考.
?升級系統,把php5.2.9升級到5.3.6,按照以前的編譯參數,configure能正常通過,但是在make的時候提示:
In file included from /root/php-5.3.6/ext/gd/libgd/gd_compat.c:8: /usr/local/jpeg/include/jpeglib.h:938: error: expected declaration specifiers or ‘...’ before ‘FILE’ /usr/local/jpeg/include/jpeglib.h:939: error: expected declaration specifiers or ‘...’ before ‘FILE’ make: *** [ext/gd/libgd/gd_compat.lo] Error 1 百度谷歌了好久,網上給的方案是修改 php-5.3.6/ext/gd/libgd/gd_compat.c 的代碼。把文件里面的png.h和jpeglib.h路徑改成自己環境下的絕對路徑,比如:/usr/local/libpng/include/png.h ?和 /usr/local/jpeg/include/jpeglib.h 重新configure, make 結果還是不行,提示同樣錯誤。后來看到國外的一個論壇上找到了解決方法: 修改php-5.3.6/ext/gd/libgd/gd_compat.c 把png.h 改成絕對路徑(這個在編譯gd庫的時候應該就碰到了,同樣的路徑即可) 并在# include <jpeglib.h> 前面增加一行?#include <stdio.h>??? ? 然后make clean 重新configure ?、make 、make install?就可以了。轉載于:https://www.cnblogs.com/gaohj/p/3274697.html
總結
以上是生活随笔為你收集整理的php5.3.*编译出现make: *** [ext/gd/libgd/gd_compat.lo] Error 1 解决方法的全部內容,希望文章能夠幫你解決所遇到的問題。
- 上一篇: freemarker配置
- 下一篇: 测试最大在线用户数